# Task 25: Integration and End-to-End Testing Results

## Test Execution Summary

**Date**: January 26, 2026
**Test Framework**: Jasmine/Karma with ChromeHeadless
**Total Tests**: 749
**Executed**: 256 (before timeout)
**Passed**: 248
**Failed**: 8
**Status**: ⚠️ INCOMPLETE - Browser disconnected after 30 seconds

## Test Failures Identified

### 1. BookingCancellationComponent - Refund Calculation
**File**: `src/app/features/booking/components/booking-cancellation/booking-cancellation.component.spec.ts:206`
**Issue**: Partial cancellation refund calculation is incorrect
- Expected refund: 50, Actual: 600
- Expected charges: 450, Actual: 0
**Impact**: Medium - Affects booking cancellation feature
**Status**: ❌ FAILED

### 2. WalletOverviewComponent - Responsive Table Handling (3 failures)
**Files**: `src/app/features/wallet/wallet-overview/wallet-overview-responsive.spec.ts`

#### 2a. Tablet View Horizontal Scroll
- **Line**: 176
- **Issue**: Table not scrollable on tablet view
- **Expected**: Scroll width > 0
- **Actual**: 0
- **Status**: ❌ FAILED

#### 2b. Desktop View Card Display
- **Line**: 130
- **Issue**: Mobile card view showing on desktop
- **Expected**: display = 'none'
- **Actual**: display = 'block'
- **Status**: ❌ FAILED

#### 2c. Mobile Card Spacing
- **Line**: 305-311
- **Issue**: Mobile cards have no spacing/padding
- **Expected**: Padding > 0
- **Actual**: 0
- **Status**: ❌ FAILED

### 3. ReportsComponent - Responsive Table Handling (4 failures)
**Files**: `src/app/features/reports/reports-responsive.spec.ts`

#### 3a. Empty State on Desktop
- **Line**: 317
- **Issue**: Empty state element not found
- **Expected**: Element to be truthy
- **Actual**: null
- **Status**: ❌ FAILED

#### 3b. Empty State on Mobile
- **Line**: 325
- **Issue**: Empty state element not found
- **Expected**: Element to be truthy
- **Actual**: null
- **Status**: ❌ FAILED

#### 3c. Table Accessibility
- **Line**: 341-342
- **Issue**: Table structure missing for screen readers
- **Expected**: Table elements to be truthy
- **Actual**: null
- **Status**: ❌ FAILED

#### 3d. Tablet Table Width
- **Line**: 181
- **Issue**: Table minimum width too small
- **Expected**: >= 600px
- **Actual**: 400px
- **Status**: ❌ FAILED

### 4. AgencyActivationComponent - AfterAll Error
**File**: `src/app/features/admin/agency-activation/agency-activation.component.ts:287`
**Issue**: TypeError - Cannot read properties of undefined (reading 'get')
**Impact**: High - Causes test suite to error out
**Status**: ❌ ERROR

## Compilation Errors

### SCSS Import Issues (RESOLVED)
- **Issue**: SCSS files couldn't find stylesheet imports
- **Files Affected**: 
  - `login.component.scss`
  - `reports.component.scss`
  - `support-center.component.scss`
  - `wallet-topup.component.scss`
- **Resolution**: Changed from `@import` to `@use` with proper module syntax
- **Status**: ✅ FIXED

## Test Coverage

**Coverage Report**: Not generated (tests timed out before completion)
**Target**: 80% code coverage minimum
**Status**: ⚠️ INCOMPLETE

## Critical User Journeys Status

### 1. Login Flow
- **Status**: ✅ PASSING (based on partial results)
- **Tests Executed**: Authentication service, guards, login component

### 2. Flight Search and Booking Flow
- **Status**: ✅ MOSTLY PASSING
- **Tests Executed**: Search, passenger details, payment components
- **Issue**: Booking cancellation refund calculation needs fix

### 3. Wallet Management
- **Status**: ⚠️ PARTIAL
- **Tests Executed**: Wallet service, overview, top-up components
- **Issues**: Responsive table handling failures

### 4. Dashboard Display
- **Status**: ✅ PASSING (based on partial results)
- **Tests Executed**: Dashboard component, metrics display

### 5. Responsive Behavior
- **Status**: ❌ FAILING
- **Issues**: Multiple responsive table and layout failures

## Recommendations

### Immediate Actions Required

1. **Fix AgencyActivationComponent Error** (Priority: HIGH)
   - Line 287 has undefined reference
   - Blocking test suite completion
   - Likely a form control or service reference issue

2. **Fix Booking Cancellation Refund Logic** (Priority: HIGH)
   - Refund calculation for partial cancellations is incorrect
   - Business logic error that affects real functionality

3. **Fix Responsive Table Implementations** (Priority: MEDIUM)
   - Wallet overview responsive tables not working correctly
   - Reports responsive tables missing elements
   - Affects user experience on mobile/tablet devices

4. **Increase Test Timeout** (Priority: MEDIUM)
   - Browser disconnected after 30 seconds
   - Need to complete full test suite (749 tests)
   - Consider increasing Karma timeout configuration

### Next Steps

1. Fix the 8 failing tests
2. Fix the AgencyActivationComponent error
3. Re-run full test suite with increased timeout
4. Generate and review code coverage report
5. Verify all 749 tests pass
6. Document any remaining issues or limitations

## Test Environment

- **OS**: Mac OS 10.15.7
- **Browser**: Chrome Headless 144.0.0.0
- **Node Version**: (from package.json dependencies)
- **Angular Version**: 16.2.0
- **Test Runner**: Karma 6.4.4
- **Test Framework**: Jasmine 4.6.0

## Notes

- Tests are well-structured with good coverage of components
- Property-based tests using fast-check are included
- Most core functionality tests are passing
- Issues are primarily in responsive design and edge case handling
- No critical authentication or security issues found in passing tests
